Produits cosmétiques
narrower: cb12320762v
related: cb16773176w
narrower: https://data.bnf.fr/ark:/12148/cb122589336
narrower: cb15601305p
narrower: cb11937402z
domaine litteral: Économie domestique. Cuisine
narrower: cb17084213n
narrower: https://data.bnf.fr/ark:/12148/cb180786020
type: Concept
P61160: http://www.rdaregistry.info/termList/statIdentification/1001
narrower: cb12556420h
related: https://data.bnf.fr/ark:/12148/cb133330849
narrower: https://data.bnf.fr/ark:/12148/cb120107326
narrower: https://data.bnf.fr/ark:/12148/cb167343118
related: https://data.bnf.fr/ark:/12148/cb125659189
narrower: https://data.bnf.fr/ark:/12148/cb17152227d
broader: cb12135353v
narrower: cb16589072j
alternative label: Soins de beauté, Produits de
related: cb12050328p
alternative label: Cosmétiques
FRBNF: 11964867
domaine: https://data.bnf.fr/ark:/12148/cb11933091b
narrower: https://data.bnf.fr/ark:/12148/cb16208277d
related: https://data.bnf.fr/ark:/12148/cb16621059b
related: https://data.bnf.fr/ark:/12148/cb11965430b
modified: 2018-12-07
created: 1985-07-06
is part of: r166
alternative label: Produits de soins de beauté
related: cb11931033p
editorial note: Grand Robert de la langue française, 2001 (art. : Cosmétique). - . - Académie nationale de pharmacie. - http://dictionnaire.acadpharm.org. - 2017-10-04
scope note: Voir aussi la subdivision Emploi en cosmétologie aux êtres vivants, matériaux, parties du corps, produits chimiques (à l'exception des médicaments) et sujets noms communs appropriés
narrower: cb12009322r
related: cb12558332q
narrower: https://data.bnf.fr/ark:/12148/cb119377750
narrower: https://data.bnf.fr/ark:/12148/cb144536313
narrower: cb12563194q
narrower: cb16156746w

Cosmetics

Cosmetics