Sociologie de la culture
related: cb11945231q
created: 1985-07-06
P61160: http://www.rdaregistry.info/termList/statIdentification/1001
broader: https://data.bnf.fr/ark:/12148/cb133408573
domaine litteral: Sciences sociales. Sociologie
related match: Culture
narrower: cb12651507j
narrower: https://data.bnf.fr/ark:/12148/cb18004355b
modified: 2023-06-07
narrower: cb13620330s
narrower: cb11933284m
type: Concept
alternative label: Pratiques culturelles
scope note: Sous cette vedette, on trouve des documents qui traitent de la culture d'un point de vue sociologique, ou de la sociologie de la culture comme discipline
editorial note: Encycl. universalis (art. : Culture - Sociologie de la culture). - http://www.universalis-edu.com. - 2018-01-12 Dict. de sociologie / A. Akoun, P. Ansart, 1999 (art. : Sociologie de la culture). - . -
FRBNF: 11965562
narrower: https://data.bnf.fr/ark:/12148/cb159554989
alternative label: Culture -- Sociologie
broader: cb11931827z
is part of: r166