Lecture
FRBNF: 11965676
related: https://data.bnf.fr/ark:/12148/cb11936326f
related: https://data.bnf.fr/ark:/12148/cb121199234
is part of: r166
narrower: cb18090675p
related: https://data.bnf.fr/ark:/12148/cb133183540
related: cb11930885w
type: Concept
scope note: Sous cette vedette, on trouve les documents sur le savoir lire. Les documents sur la lecture du point de vue de l'information, de la culture, etc., se trouvent sous Livres et lecture
broader: https://data.bnf.fr/ark:/12148/cb120423179
related: cb11953960z
narrower: cb11955657q
domaine litteral: Linguistique générale
related: cb11982775t
alternative label: Lecture en langue maternelle
narrower: cb11932237v
related: cb12321659x
created: 1985-07-06
narrower: https://data.bnf.fr/ark:/12148/cb136146849
modified: 2024-03-11
scope note: S'emploie également en subdivision. Cette subdivision s'applique aux Livres sacrés, pour des méthodes de lecture et d'annotation des livres sacrés ainsi que pour des listes de passages à lire, par ex. : Bible -- Lecture
related: https://data.bnf.fr/ark:/12148/cb119591788
related: https://data.bnf.fr/ark:/12148/cb166283157
narrower: https://data.bnf.fr/ark:/12148/cb177929214
alternative label: Lecture en langue seconde
related: https://data.bnf.fr/ark:/12148/cb123465656
P61160: http://www.rdaregistry.info/termList/statIdentification/1001
related: cb12647534p
narrower: cb12649776n
related: https://data.bnf.fr/ark:/12148/cb14603769c

Reading

Reading