Planification
modified: 2018-12-07
narrower: https://data.bnf.fr/ark:/12148/cb11976041b
related: cb13319365w
scope note: S'emploie également en subdivision aux collectivités, industries et sujets noms communs appropriés (activités, équipements, etc.), par ex. : Routes -- Planification
broader: cb11977946s
related: https://data.bnf.fr/ark:/12148/cb125525842
narrower: cb11947858w
FRBNF: 11972123
broader: cb11930827q
narrower: https://data.bnf.fr/ark:/12148/cb122354957
is part of: r166
related match: Planning
broader: cb11950206h
domaine litteral: Économie politique. Travail
narrower: cb11983080q
narrower: cb12006868q
alternative label: Planning
broader: cb11951020r
related: https://data.bnf.fr/ark:/12148/cb11933911b
narrower: cb12137790n
narrower: cb13337749p
related: cb11971487j
created: 1985-07-06
P61160: http://www.rdaregistry.info/termList/statIdentification/1001
type: Concept