Sites archéologiques
alternative label: Vestiges archéologiques
created: 1985-07-06
related: cb11943941g
narrower: cb11975070p
alternative label: Gisements archéologiques
related match: Excavations (Archaeology)
domaine litteral: Archéologie. Préhistoire. Histoire ancienne
broader: cb15074326s
scope note: Voir aussi aux sites archéologiques particuliers, par ex. : Malia (Grèce ; site archéologique)
editorial note: Les mises en valeur de sites archéologiques en France / A. Delmas, 1988. - . - Guide des méthodes de l'archéologie, 2002. - . - Atlas mondial des sites archéologiques / N. Constable, 2006. - . -
related: cb13318420z
scope note: Sous cette vedette, on trouve les documents sur les sites archéologiques. Les comptes rendus de fouilles se trouvent sous Fouilles archéologiques
related: cb11933273z
alternative label: Ruines archéologiques
broader: cb13318444z
P61160: http://www.rdaregistry.info/termList/statIdentification/1001
alternative label: Archéologie -- Sites
related: cb13610184z
is part of: r166
narrower: cb17060331g
broader: https://data.bnf.fr/ark:/12148/cb133190710
related: https://data.bnf.fr/ark:/12148/cb119418066
type: Concept
modified: 2023-06-08
broader: https://data.bnf.fr/ark:/12148/cb12355758f
FRBNF: 11975069