Expériences
scope note: Voir aussi la subdivision de forme Manuels de laboratoire aux sujets scientifiques ou techniques
FRBNF: 11975868
alternative label: Manipulations (physique)
alternative label: Manipulations (chimie)
P61160: http://www.rdaregistry.info/termList/statIdentification/1001
created: 1985-07-06
scope note: S'emploie uniquement en subdivision aux êtres vivants et sujets scientifiques et techniques pour des études sur les expériences et des instructions sur la façon de les conduire
alternative label: Travaux pratiques
related: cb11975894w
scope note: Voir aussi la subdivision Essais aux produits chimiques (médicaments seulement) et sujets noms communs appropriés (équipements, machines, objets, etc.) pour des études sur les essais de leur efficacité, fiabilité, etc., ou pour les résultats de ces essais, par ex. Chaussées -- Essais
domaine: cb11933639w
alternative label: Expérimentation
related: https://data.bnf.fr/ark:/12148/cb119767836
related: https://data.bnf.fr/ark:/12148/cb11939874d
is part of: r166
type: Concept
modified: 2018-12-07
related match: Experiments
related: https://data.bnf.fr/ark:/12148/cb120815748
domaine: https://data.bnf.fr/ark:/12148/cb11933232c