Armées
related: cb12349125k
narrower: https://data.bnf.fr/ark:/12148/cb126475022
alternative label: Armée
scope note: Sous cette vedette, on trouve les documents sur les armées de terre. Les documents qui traitent de l'ensemble des forces armées (Terre, Air, Mer) sont sous la vedette Forces armées
alternative label: Armée de terre
narrower: cb11930978w
scope note: Voir aussi aux noms des armées particulières, par ex. : France. Armée ; Grande-Bretagne. Army
related match: Armies
narrower: https://data.bnf.fr/ark:/12148/cb121317263
alternative label: Armées de terre
broader: https://data.bnf.fr/ark:/12148/cb11952003d
narrower: https://data.bnf.fr/ark:/12148/cb137547926
created: 1985-07-06
P61160: http://www.rdaregistry.info/termList/statIdentification/1001
is part of: r166
modified: 2018-09-11
narrower: https://data.bnf.fr/ark:/12148/cb170046164
narrower: https://data.bnf.fr/ark:/12148/cb119344298
FRBNF: 11976646
narrower: https://data.bnf.fr/ark:/12148/cb119471804
type: Concept
domaine: https://data.bnf.fr/ark:/12148/cb133183002