Mannequins (personnes)
domaine litteral: Économie politique. Travail
is part of: r166
related: https://data.bnf.fr/ark:/12148/cb169028843
domaine litteral: Catégories de personnes
alternative label: Femmes mannequins
related match: Models (Persons)
created: 1985-07-07
type: Concept
P61160: http://www.rdaregistry.info/termList/statIdentification/1001
alternative label: Modèles (personnes)
broader: https://data.bnf.fr/ark:/12148/cb119771604
FRBNF: 11978043
alternative label: Top models
alternative label: Cover-girls
related: cb11968862s
narrower: https://data.bnf.fr/ark:/12148/cb124840989
related: cb14408112m
scope note: Sous cette vedette, on trouve les documents sur les mannequins en général ou sur les mannequins féminins. Les documents traitant uniquement des mannequins masculins sont sous Mannequins (hommes)
modified: 2023-06-07
alternative label: Top models (femmes)
alternative label: Mannequins (femmes)
narrower: cb12484099n