Administration
related: cb11940923t
P61160: http://www.rdaregistry.info/termList/statIdentification/1001
scope note: Voir aussi la subdivision Gestion aux collectivités, forces armées et industries
domaine: cb11930827q
modified: 2023-06-08
related match: Administrative agencies
type: Concept
related: cb11950206h
related: https://data.bnf.fr/ark:/12148/cb119384909
FRBNF: 12042319
created: 1987-06-12
related: https://data.bnf.fr/ark:/12148/cb119708951
domaine: cb11950206h
is part of: r166
scope note: S'emploie uniquement en subdivision aux collectivités (notamment aux bibliothèques, établissements d'enseignement, établissements de soins). - Ne pas employer aux entreprises, ministères et organismes administratifs, forces armées, musées et parcs
narrower: cb12062276z
related: cb11930827q

Administration