Art -- 1990-....
scope note: Sous cette vedette, on trouve les documents généraux sur l'art depuis 1990. Les documents sur l'art depuis 1990 dans un lieu précis se trouvent sous des vedettes-matière du type : Art -- [Subdivision géographique] -- 1990-....:
type: Concept
narrower: cb12444865q
domaine: cb11934758p
created: 1995-02-03
alternative label: Art moderne -- 1990-....
broader: https://data.bnf.fr/ark:/12148/cb11935705b
focus: dc:Event
modified: 2018-12-07
narrower: https://data.bnf.fr/ark:/12148/cb151176206
FRBNF: 12444859
P61160: http://www.rdaregistry.info/termList/statIdentification/1001
is part of: r166
narrower: cb14494056v
narrower: cb16684599x

dc:Event
date: 1990
date: https://data.bnf.fr/date/1990/