Éducation physique et sportive
alternative label: Préparation physique
related match: Physical training
FRBNF: 13162711
is part of: r166
alternative label: Culture physique
domaine: cb13318807v
related match: Physical education and training
narrower: https://data.bnf.fr/ark:/12148/cb119409454
narrower: cb11965230s
narrower: https://data.bnf.fr/ark:/12148/cb12048833c
alternative label: Activités physiques
editorial note: Vocabulaire de l'Éducation / G. Mialaret, 1979. - . - Éducation physique et sportive. - http:www.education.gouv.fr. - 2013-02-20 L'EPS et les sports collectifs : basket-ball, volley-ball / A. Bollatre, 2012. - . -
narrower: cb12559557v
broader: cb12304074g
related: cb16555786k
broader: cb13318807v
related: cb11970698h
domaine: https://data.bnf.fr/ark:/12148/cb119832928
narrower: https://data.bnf.fr/ark:/12148/cb157583225
narrower: cb17001211k
alternative label: Activités sportives
related: cb11933308s
related: https://data.bnf.fr/ark:/12148/cb119821399
narrower: cb11936828h
scope note: S'emploie également en subdivision. Cette subdivision s'applique aux catégories de personnes et aux forces armées
P61160: http://www.rdaregistry.info/termList/statIdentification/1001
narrower: https://data.bnf.fr/ark:/12148/cb119649414
related: cb11938379h
domaine litteral: Sports et jeux
alternative label: Éducation physique
created: 1985-07-06
narrower: https://data.bnf.fr/ark:/12148/cb119800982
scope note: Sous cette vedette, on trouve les documents sur l'éducation physique et sportive réalisée dans le cadre scolaire
narrower: https://data.bnf.fr/ark:/12148/cb17760261b
modified: 2023-06-07
related match: Physical Education and Training
type: Concept
alternative label: EPS
alternative label: Activités physiques et sportives éducatives
alternative label: Entraînement physique et sportif