Fonds d'archives
alternative label: Archives -- Fonds
P61160: http://www.rdaregistry.info/termList/statIdentification/1001
created: 1985-07-06
broader: cb13318572g
alternative label: Archives déclassifiées
modified: 2023-06-08
scope note: Voir aussi la subdivision Archives aux catégories de personnes, collectivités, groupes ethniques et personnes
related: https://data.bnf.fr/ark:/12148/cb167674336
is part of: r166
related: https://data.bnf.fr/ark:/12148/cb169665160
alternative label: Ressources archivistiques
scope note: Sous cette vedette, on trouve les documents sur les ressources archivistiques disponibles pour la recherche dans différents domaines
scope note: S'emploie également en subdivision. Cette subdivision s'applique aux guerres et à tous sujets noms communs pour les ressources archivistiques disponibles sur ces sujets
alternative label: Archives communicables
domaine litteral: Sciences de l'information et de la documentation
related match: Archival resources
FRBNF: 13318797
type: Concept