Magnétisme
narrower: cb11983062s
scope note: Voir aussi la subdivision Propriétés magnétiques aux êtres vivants, matériaux, parties du corps, produits chimiques et sujets noms communs appropriés
narrower: cb11983067h
FRBNF: 13319014
domaine: cb11933127h
narrower: https://data.bnf.fr/ark:/12148/cb119830723
narrower: cb11983065t
narrower: https://data.bnf.fr/ark:/12148/cb11983070d
narrower: cb11983068v
is part of: r166
broader: cb11933127h
narrower: https://data.bnf.fr/ark:/12148/cb11977876f
narrower: cb11983071r
narrower: cb13319704s
narrower: https://data.bnf.fr/ark:/12148/cb119790025
narrower: cb11979397h
narrower: https://data.bnf.fr/ark:/12148/cb119830696
narrower: cb11982075w
related: https://data.bnf.fr/ark:/12148/cb119761570
related match: Magnetism
narrower: https://data.bnf.fr/ark:/12148/cb131879624
narrower: cb11965936s
narrower: cb12140969w
narrower: cb11983074s
narrower: cb18086866h
narrower: https://data.bnf.fr/ark:/12148/cb11944366d
related: https://data.bnf.fr/ark:/12148/cb122906171
narrower: https://data.bnf.fr/ark:/12148/cb133243814
related: https://data.bnf.fr/ark:/12148/cb119830634
created: 1985-07-06
narrower: cb12111982q
narrower: https://data.bnf.fr/ark:/12148/cb135429278
narrower: https://data.bnf.fr/ark:/12148/cb133183393
related: cb11944550k
P61160: http://www.rdaregistry.info/termList/statIdentification/1001
narrower: cb11932317h
narrower: https://data.bnf.fr/ark:/12148/cb122651475
narrower: https://data.bnf.fr/ark:/12148/cb171501714
modified: 2023-06-07
related: https://data.bnf.fr/ark:/12148/cb11983073f
type: Concept
related: https://data.bnf.fr/ark:/12148/cb119830665
narrower: https://data.bnf.fr/ark:/12148/cb119812667
narrower: cb17099173n