Architectes
related: cb15591312n
related: https://data.bnf.fr/ark:/12148/cb12457906d
related: cb12492039h
narrower: cb12325551v
related: https://data.bnf.fr/ark:/12148/cb119516808
related: cb15503439k
scope note: Voir aussi les subdivisions Oeuvres -- Architecture et Contribution à la réflexion sur l'architecture aux personnes
FRBNF: 11930938
broader: cb13318455m
related: cb11999159t
narrower: cb12492048g
narrower: https://data.bnf.fr/ark:/12148/cb125551197
narrower: cb16677477v
related: cb13319755p
related: cb12050461s
related: cb12365233x
narrower: https://data.bnf.fr/ark:/12148/cb179054469
related: cb12398066p
related: cb12217268v
scope note: Voir aussi les vedettes du type Architectes [adjectif ethnique, de nationalité ou géographique]
narrower: https://data.bnf.fr/ark:/12148/cb11944342d
modified: 2023-06-08
type: Concept
P61160: http://www.rdaregistry.info/termList/statIdentification/1001
editorial note: Grand Larousse universel. - . - Nouveau petit Robert 2010. - . - Nouveau Littré 2006. - . -
domaine litteral: Catégories de personnes
domaine: https://data.bnf.fr/ark:/12148/cb133183211
related: https://data.bnf.fr/ark:/12148/cb133183211
narrower: cb12325553j
created: 1985-07-06
is part of: r166
narrower: https://data.bnf.fr/ark:/12148/cb125035112

Architects