Australie
related: cb11960877w
scope note: Voir aussi la subdivision Opinion publique australienne [sans subd. géogr.] aux guerres et aux lieux
narrower: https://data.bnf.fr/ark:/12148/cb122343424
P61160: http://www.rdaregistry.info/termList/statIdentification/1001
FRBNF: 11930990
related: cb17996787t
related: https://data.bnf.fr/ark:/12148/cb120207401
narrower: https://data.bnf.fr/ark:/12148/cb161896208
editorial note: Grand Larousse universel. - . - Encycl. universalis. - http://www.universalis-edu.com. - 2016-02-03 Atlas universel / "Le Monde", Sélection du "Reader's digest" 2000. - . -
related: cb12129570r
narrower: cb14616229p
broader: https://data.bnf.fr/ark:/12148/cb11951560c
related: https://data.bnf.fr/ark:/12148/cb121187460
type: Concept
related: https://data.bnf.fr/ark:/12148/cb12129695c
related: https://data.bnf.fr/ark:/12148/cb121676513
modified: 2017-02-13
related: https://data.bnf.fr/ark:/12148/cb120480335
narrower: https://data.bnf.fr/ark:/12148/cb12494617b
created: 1985-07-06
related: cb12249791v
related: cb12118745n
domaine litteral: Géographie du reste du monde
narrower: https://data.bnf.fr/ark:/12148/cb135631836
related: cb15522911r
is part of: r167
narrower: cb12542920q
narrower: https://data.bnf.fr/ark:/12148/cb12050120c

Australia