Finlande
FRBNF: 11931409
related: cb16084616n
scope note: Voir aussi la subdivision Et la Finlande aux personnes et collectivités
related: https://data.bnf.fr/ark:/12148/cb124909474
related: cb12548567q
is part of: r167
related: https://data.bnf.fr/ark:/12148/cb120328629
created: 1985-07-06
related: cb11971202s
modified: 2017-02-13
broader: cb12542938s
type: Concept
broader: https://data.bnf.fr/ark:/12148/cb119411633
broader: https://data.bnf.fr/ark:/12148/cb11934129f
P61160: http://www.rdaregistry.info/termList/statIdentification/1001

Finland