Autriche
P61160: http://www.rdaregistry.info/termList/statIdentification/1001
related: cb12031407t
is part of: r167
related: https://data.bnf.fr/ark:/12148/cb122144780
created: 1985-07-06
related: https://data.bnf.fr/ark:/12148/cb123818273
related: https://data.bnf.fr/ark:/12148/cb121914015
FRBNF: 11931653
related: https://data.bnf.fr/ark:/12148/cb120272421
modified: 2017-02-13
related: https://data.bnf.fr/ark:/12148/cb123809301
related: https://data.bnf.fr/ark:/12148/cb119589876
broader: https://data.bnf.fr/ark:/12148/cb11934129f
scope note: Voir aussi la subdivision Et l'Autriche aux personnes et collectivités
type: Concept
scope note: Sous cette vedette, on trouve les ouvrages qui traitent de l'Autriche, des origines à nos jours, quelles qu'aient été son étendue territoriale et son régime politique. Cependant les ouvrages relatifs à l'Autriche-Hongrie (1867-1918) se trouvent sous la vedette Autriche-Hongrie ; et ceux qui, pour la même période, se limitent à la partie autrichienne de l'empire (Cisleithanie) se trouvent sous la vedette Autriche, suivie des subdivisions de sujet et chronologiques appropriées
related: https://data.bnf.fr/ark:/12148/cb12001886f
related: cb12107597w
broader: cb11976754m
editorial note: IFLA, Names of states, 1981. - . - Österreich ; GKD, 1994-05 ; SWD, 1995-04. - . -
scope note: Voir aussi la subdivision Réclamations contre l'Autriche aux lieux

Austria