Juifs
related: cb12084282s
narrower: cb18122001p
narrower: cb12243948t
narrower: cb12026815j
alternative label: Et les Juifs
related: https://data.bnf.fr/ark:/12148/cb11934625f
P61160: http://www.rdaregistry.info/termList/statIdentification/1001
created: 1985-07-06
narrower: https://data.bnf.fr/ark:/12148/cb122709419
narrower: cb12446749p
modified: 2023-12-29
narrower: https://data.bnf.fr/ark:/12148/cb150830080
alternative label: Relations avec les Juifs
narrower: cb16269199x
scope note: Voir aussi les vedettes du type : [Guerre] -- Juifs ; [Force armée] -- Juifs, par ex. : Guerre mondiale (1939-1945) -- Juifs
narrower: cb12552442v
related: cb11945501m
narrower: cb18105494x
narrower: cb14576503w
narrower: cb11983722g
narrower: https://data.bnf.fr/ark:/12148/cb119687944
narrower: https://data.bnf.fr/ark:/12148/cb135579208
related: cb16934955w
narrower: https://data.bnf.fr/ark:/12148/cb119363509
broader: cb12380440z
editorial note: Grand Larousse universel. - . - Dict. encyclopédique Quillet, 1989-1995. - . -
related: https://data.bnf.fr/ark:/12148/cb119604633
narrower: cb17157889t
narrower: cb11945227g
narrower: cb18143204x
related: cb12120315w
related: https://data.bnf.fr/ark:/12148/cb133184292
narrower: https://data.bnf.fr/ark:/12148/cb123071645
narrower: https://data.bnf.fr/ark:/12148/cb119468350
FRBNF: 11932167
narrower: cb11940694h
narrower: https://data.bnf.fr/ark:/12148/cb165026678
narrower: https://data.bnf.fr/ark:/12148/cb119713382
narrower: cb13188431q
alternative label: Israélites
alternative label: Hébreux
narrower: cb17094715x
narrower: https://data.bnf.fr/ark:/12148/cb170807628
narrower: https://data.bnf.fr/ark:/12148/cb119494139
narrower: cb14446033n
narrower: cb13752735w
narrower: https://data.bnf.fr/ark:/12148/cb119768108
narrower: https://data.bnf.fr/ark:/12148/cb12048259d
narrower: cb16078902j
related: https://data.bnf.fr/ark:/12148/cb133183529
narrower: cb12130677g
related: https://data.bnf.fr/ark:/12148/cb119416415
narrower: https://data.bnf.fr/ark:/12148/cb11971742d
type: Concept
related: https://data.bnf.fr/ark:/12148/cb119476330
related: https://data.bnf.fr/ark:/12148/cb119741298
narrower: cb12022842g
narrower: cb16632853x
narrower: https://data.bnf.fr/ark:/12148/cb11974406f
narrower: cb11948034x
is part of: r166
related: cb11951342w
narrower: https://data.bnf.fr/ark:/12148/cb137397893
narrower: https://data.bnf.fr/ark:/12148/cb145707150
narrower: cb11947830h
narrower: cb11959573n
narrower: cb12497878t
narrower: https://data.bnf.fr/ark:/12148/cb12488471b
related: https://data.bnf.fr/ark:/12148/cb119750026
related: cb11935896r
domaine: cb12648641g
scope note: La nationalité ou le lieu habituel de résidence sont indiqués par la subdivision géographique, par ex. : Juifs -- Allemagne. La vedette Juifs peut être précisée par un adjectif de nationalité ou géographique pour désigner l'origine géographique de Juifs expatriés, par ex. : Juifs allemands -- Brésil (la vedette Juifs [adjectif de nationalité ou d'origine géographique] est alors obligatoirement suivie d'une subdivision géographique)
narrower: https://data.bnf.fr/ark:/12148/cb165034507
narrower: cb12036840z
narrower: cb11949612h
related: https://data.bnf.fr/ark:/12148/cb160358799
related: cb11969470j
narrower: cb11932129z
related: cb11934332w

Jews

Jews