Réalisateurs de cinéma
is part of: r166
modified: 2018-09-25
scope note: Voir aussi les vedettes du type Réalisateurs de cinéma [adjectif ethnique, de nationalité ou géographique], par ex. : Réalisateurs de cinéma noirs américains
created: 1985-07-06
broad match: Motion picture producers and directors
alternative label: Registi cinematografici @it
narrower: https://data.bnf.fr/ark:/12148/cb135073092
related: cb12141349v
alternative label: Cinéma -- Réalisateurs
narrower: cb17702343x
P61160: http://www.rdaregistry.info/termList/statIdentification/1001
related: https://data.bnf.fr/ark:/12148/cb158968431
broader: cb13318455m
alternative label: Metteurs en scène (cinéma)
FRBNF: 11932643
alternative label: Cinéastes
domaine: https://data.bnf.fr/ark:/12148/cb119517649
narrower: cb15076736p
domaine litteral: Catégories de personnes
alternative label: Cinéma -- Metteurs en scène
type: Concept
alternative label: Réalisateurs de films
related: cb13162764n
broader: cb16739258v
editorial note: Grand Larousse universel : réalisateur. - . - Vocabulaire technique du cinéma / V. Pinel, 1996 : réalisateur. - . -
narrower: https://data.bnf.fr/ark:/12148/cb11947430d
related: https://data.bnf.fr/ark:/12148/cb161159660

Registi cinematografici