Peinture
alternative label: Et la peinture
narrower: https://data.bnf.fr/ark:/12148/cb12238385c
narrower: cb12143759r
narrower: https://data.bnf.fr/ark:/12148/cb13557229f
alternative label: Oeuvres -- Peinture
narrower: https://data.bnf.fr/ark:/12148/cb11952451c
narrower: cb12047059m
related: cb11933055g
narrower: cb11959240v
modified: 2023-12-20
broader: cb11934758p
narrower: https://data.bnf.fr/ark:/12148/cb133240296
narrower: cb18071504q
related: https://data.bnf.fr/ark:/12148/cb12474742d
narrower: cb11959239n
narrower: https://data.bnf.fr/ark:/12148/cb120034964
narrower: cb11933059v
narrower: cb13339995w
related: https://data.bnf.fr/ark:/12148/cb11995948d
related: cb11956935g
narrower: cb12461701w
narrower: https://data.bnf.fr/ark:/12148/cb181208916
is part of: r166
narrower: https://data.bnf.fr/ark:/12148/cb119309259
narrower: cb12263808q
editorial note: Trésor de la langue française. - . - Nouveau petit Robert 1993. - . -
created: 1985-07-06
narrower: https://data.bnf.fr/ark:/12148/cb133356268
related: https://data.bnf.fr/ark:/12148/cb119532512
narrower: https://data.bnf.fr/ark:/12148/cb166895080
narrower: https://data.bnf.fr/ark:/12148/cb15600143f
alternative label: Peinture artistique
alternative label: Tableaux (peinture)
narrower: cb12382203p
type: Concept
narrower: cb14599066j
alternative label: Oeuvre peinte
narrower: https://data.bnf.fr/ark:/12148/cb120346100
related: cb12138053r
narrower: https://data.bnf.fr/ark:/12148/cb18099343d
related: https://data.bnf.fr/ark:/12148/cb11935393b
scope note: Voir aussi les vedettes du type Peinture [adjectif de civilisation, ethnique, de nationalité ou géographique, de religion ou de style]
related: https://data.bnf.fr/ark:/12148/cb11966946b
alternative label: Attitude envers la peinture
narrower: https://data.bnf.fr/ark:/12148/cb119460751
P61160: http://www.rdaregistry.info/termList/statIdentification/1001
narrower: https://data.bnf.fr/ark:/12148/cb11933061d
related: cb12211287p
narrower: cb12116224t
related: https://data.bnf.fr/ark:/12148/cb119466254
narrower: https://data.bnf.fr/ark:/12148/cb123954333
narrower: https://data.bnf.fr/ark:/12148/cb169612477
narrower: cb11959236m
related: cb12341258w
narrower: https://data.bnf.fr/ark:/12148/cb177454830
narrower: https://data.bnf.fr/ark:/12148/cb166893580
related: cb15881534t
narrower: https://data.bnf.fr/ark:/12148/cb119402425
narrower: cb11932589x
related: https://data.bnf.fr/ark:/12148/cb126538729
narrower: https://data.bnf.fr/ark:/12148/cb119329473
narrower: https://data.bnf.fr/ark:/12148/cb11933064f
narrower: https://data.bnf.fr/ark:/12148/cb162573079
alternative label: Connaissances -- Peinture
alternative label: Art de la peinture
narrower: cb11963376w
narrower: cb11961443q
related: cb12463742z
related: cb11982119p
narrower: https://data.bnf.fr/ark:/12148/cb119360018
narrower: https://data.bnf.fr/ark:/12148/cb11935297f
related: cb11933053s
narrower: cb12497562m
narrower: https://data.bnf.fr/ark:/12148/cb179946543
alternative label: Pittura @it
scope note: S'emploie également en subdivision
narrower: cb16747916k
narrower: https://data.bnf.fr/ark:/12148/cb119459847
alternative label: Peintures
narrower: https://data.bnf.fr/ark:/12148/cb11998297d

Painting

Pittura