Philosophes
alternative label: Philosophie -- Biographies
narrower: cb11932528q
domaine: https://data.bnf.fr/ark:/12148/cb119368422
type: Concept
narrower: cb11933100g
related: cb14482310p
alternative label: Philosophie -- Biographie
domaine litteral: Catégories de personnes
narrower: https://data.bnf.fr/ark:/12148/cb12103505f
P61160: http://www.rdaregistry.info/termList/statIdentification/1001
narrower: https://data.bnf.fr/ark:/12148/cb122572947
narrower: cb16260619n
related: https://data.bnf.fr/ark:/12148/cb11935396c
narrower: https://data.bnf.fr/ark:/12148/cb121330886
scope note: Voir aussi les vedettes du type Philosophes [adjectif de civilisation, ethnique ou de religion], par ex. : Philosophes grecs, Philosophes juifs, Philosophes hindous
related: https://data.bnf.fr/ark:/12148/cb119368422
is part of: r166
narrower: cb11933101t
FRBNF: 11933102
created: 1985-07-06
narrower: cb11932045x
modified: 2023-06-07

Philosophers