Pays basque (Espagne)
narrower: cb11960768n
alternative label: Pays basque (sud)
scope note: Sous cette vedette on trouve les ouvrages qui traitent del'ensemble du Pays basque espagnol, comprenant les provinces de Biscaye, Guipúzcoa et Álava (dites "provincias vascongadas") et la province de Navarre, ou de la seule communauté autonome du Pays basque ("Gobierno vasco", "Eusko jaurlaritza", capitale : Vitoria) à l'exclusion de la Navarre qui forme une communauté autonome distincte. - Le terme basque Euskadi désigne le Pays basque en tant qu'entité politique (éventuellement supposée comme comprenant aussi le Pays basque français)
alternative label: Eusko jaurlaritza (Espagne) @eu
alternative label: Euskadi (Espagne) @eu
domaine litteral: Géographie de l'Europe
editorial note: GLU. - . - WW, Espagne 1988, p. 1077 et 1094. - . - Basque-English dict. / G. Aulestia, 1989. - . -
alternative label: Euskadi (sud) @eu
type: Concept
narrower: cb12048554h
alternative label: CAPV @es
note: Les noms géographiques du Pays basque pour lesquels il n'existe pas de forme française couramment attestée doivent être pris en basque de préférence à leur forme castillane
alternative label: País Vasco (Espagne) @es
is part of: r167
narrower: https://data.bnf.fr/ark:/12148/cb119508394
P61160: http://www.rdaregistry.info/termList/statIdentification/1001
alternative label: Pays basque espagnol
alternative label: Comunidad autónoma del País Vasco (Espagne) @es
alternative label: Vascongadas, Provincias (Espagne) @es
broader: cb12236937p
alternative label: Vasco, País (Espagne) @es
FRBNF: 11933377
narrower: cb11960951g
modified: 2022-06-28
alternative label: Euzkadi (Espagne) @eu
created: 1985-07-06
broader: https://data.bnf.fr/ark:/12148/cb11934078c

Pais Vasco (Spain)