Chypre
type: Concept
is part of: r167
created: 1985-07-06
scope note: Sous cette vedette, on trouve les documents qui traitent de l'île de Chypre ou de la République de Chypre, dont le territoire a été réduit de facto à la suite de l'intervention turque de 1974. Les documents qui traitent exclusivement de la République turque de Chypre du Nord sont sous la vedette : Chypre du Nord (République turque)
narrower: cb17972719z
narrower: cb17964757s
broader: https://data.bnf.fr/ark:/12148/cb11934129f
narrower: cb11954514x
domaine litteral: Géographie de l'Europe
narrower: cb16679159k
broader: https://data.bnf.fr/ark:/12148/cb119563036
narrower: https://data.bnf.fr/ark:/12148/cb119799150
broader: https://data.bnf.fr/ark:/12148/cb11941608b
FRBNF: 11933430
related: https://data.bnf.fr/ark:/12148/cb134914710
related: https://data.bnf.fr/ark:/12148/cb170330830
scope note: Voir aussi la subdivision Et Chypre aux collectivités et personnes
related: cb11963294j
P61160: http://www.rdaregistry.info/termList/statIdentification/1001
modified: 2017-02-13

Cyprus