Corée (République)
broader: https://data.bnf.fr/ark:/12148/cb11938541c
type: Concept
domaine litteral: Géographie du reste du monde
editorial note: Grand Larousse universel : Corée (République de). - . - Robert encyclopédique des noms propres 2008 : Corée du Sud. - . - Encycl. universalis : Corée du Sud. - http://www.universalis-edu.com. - 2011-11-04
related: https://data.bnf.fr/ark:/12148/cb121838099
related: https://data.bnf.fr/ark:/12148/cb121702776
P61160: http://www.rdaregistry.info/termList/statIdentification/1001
created: 1985-07-06
is part of: r167
modified: 2023-10-06
related: cb12317616w
related: https://data.bnf.fr/ark:/12148/cb11973464c
narrower: cb15610212n
related: https://data.bnf.fr/ark:/12148/cb119629184
related: https://data.bnf.fr/ark:/12148/cb119671738
related: cb11983205h
scope note: En précision géographique, employer Corée S., par ex. : Séoul (Corée S.)
FRBNF: 11933433

Korea (South)