Maroc
FRBNF: 11934366
related: cb13514295p
related: https://data.bnf.fr/ark:/12148/cb15545218c
scope note: Voir aussi la subdivision Et le Maroc aux personnes et collectivités
broader: https://data.bnf.fr/ark:/12148/cb119308460
narrower: cb16976857m
P61160: http://www.rdaregistry.info/termList/statIdentification/1001
created: 1985-07-06
is part of: r167
domaine litteral: Géographie du reste du monde
related: https://data.bnf.fr/ark:/12148/cb122004942
modified: 2017-02-13
related: https://data.bnf.fr/ark:/12148/cb11972044d
editorial note: IFLA, Names of states, 1981. - . - Grand Larousse universel. - . -
narrower: https://data.bnf.fr/ark:/12148/cb155005483
type: Concept

Morocco