Foi et raison
related: https://data.bnf.fr/ark:/12148/cb119329531
related: cb12072043n
is part of: r166
related: https://data.bnf.fr/ark:/12148/cb119686925
broader: https://data.bnf.fr/ark:/12148/cb119524908
related: https://data.bnf.fr/ark:/12148/cb119497928
editorial note: Raison et Révélation / P. Tillich, 2000. - . - Foi et raison dans l'Europe des Lumières, 2001. - . - Raison et foi : Averroès, Maïmonide, Thomas d'Aquin / J. Attali, 2004. - . -
type: Concept
related: cb16163856z
modified: 2018-12-07
related: cb11938278w
alternative label: Raison et foi
domaine: cb11963568t
FRBNF: 11935481
scope note: Peut se subdiviser par religion ou confession
P61160: http://www.rdaregistry.info/termList/statIdentification/1001
domaine: https://data.bnf.fr/ark:/12148/cb119368422
created: 1985-07-06
related match: Faith and reason
broader: cb13318611j