Ukraine
domaine litteral: Géographie de l'Europe
narrower: cb12005482x
broader: cb12250634s
narrower: https://data.bnf.fr/ark:/12148/cb119432317
narrower: https://data.bnf.fr/ark:/12148/cb121192298
related: cb16762105x
narrower: cb12153220j
related: https://data.bnf.fr/ark:/12148/cb119337275
created: 1985-07-06
related match: Ukraine
modified: 2017-12-20
broader: cb11931303k
scope note: Voir aussi la subdivision Et l'Ukraine aux personnes et collectivités
P61160: http://www.rdaregistry.info/termList/statIdentification/1001
related: cb14472905j
narrower: https://data.bnf.fr/ark:/12148/cb119795821
type: Concept
is part of: r167
FRBNF: 11937898
narrower: cb12050082n
related: cb16079340p
related: cb12048146s
narrower: https://data.bnf.fr/ark:/12148/cb119381460