URSS
is part of: r167
related: https://data.bnf.fr/ark:/12148/cb120094806
related: https://data.bnf.fr/ark:/12148/cb119405184
modified: 2017-02-13
scope note: Sous cette vedette, on trouve les documents sur l'ensemble des républiques socialistes soviétiques de 1917 à 1991 (bien qu'elles n'aient été réunies en fédération que le 30 décembre 1922). Les documents sur la Russie avant 1917, la République socialiste fédérative soviétique de Russie (1917-1991), et la République fédérative de Russie depuis 1991, se trouvent sous Russie
scope note: Voir aussi la subdivision Et l'URSS [sans subd. géogr.] aux collectivités et aux personnes
related: cb11993770j
type: Concept
editorial note: Grand Larousse universel. - . - Robert encyclopédique des noms propres 2008. - . - Encycl. universalis. - http://www.universalis-edu.com. - 2011-11-04
broader: https://data.bnf.fr/ark:/12148/cb119744111
FRBNF: 11939738
related: cb12023433n
broader: https://data.bnf.fr/ark:/12148/cb11970018c
created: 1985-07-06
related: cb12250634s
related: https://data.bnf.fr/ark:/12148/cb12069146f
related: https://data.bnf.fr/ark:/12148/cb120873269
related: cb12046430r
related: cb12144013r
related: https://data.bnf.fr/ark:/12148/cb120462813
related: https://data.bnf.fr/ark:/12148/cb120097298
related: cb12397971h
P61160: http://www.rdaregistry.info/termList/statIdentification/1001
related: cb11933726t
domaine litteral: Histoire du reste du monde
related: cb12069567h
domaine litteral: Géographie du reste du monde
domaine litteral: Histoire de l'Europe
domaine litteral: Géographie de l'Europe
narrower: cb13561363n