Christianisme -- Relations
created: 1985-07-06
domaine: cb11963568t
narrower: https://data.bnf.fr/ark:/12148/cb121397350
narrower: cb16231236r
narrower: https://data.bnf.fr/ark:/12148/cb150960396
related match: Christianity and other religions
type: Concept
scope note: Aucune des chaînes ainsi créées n'admet de subdivision géographique
scope note: Cette vedette peut se subdiviser par nom de religion pour parler des relations avec une religion en particulier, par ex. Christianisme -- Relations -- Bouddhisme. Une entrée additionnelle est alors faite, au catalogage, en inversant les termes : Bouddhisme -- Relations -- Christianisme
P61160: http://www.rdaregistry.info/termList/statIdentification/1001
alternative label: Christianisme et paganisme
alternative label: Paganisme et christianisme
modified: 2018-12-07
is part of: r166
FRBNF: 11952487
alternative label: Christianisme -- Relations avec les autres religions
related: cb11955308p
alternative label: Christianisme et autres religions