Philosophie et littérature
P61160: http://www.rdaregistry.info/termList/statIdentification/1001
modified: 2022-01-24
alternative label: Philosophie et poésie
is part of: r166
created: 1985-07-06
narrower: cb17137584v
alternative label: Poésie et philosophie
domaine: https://data.bnf.fr/ark:/12148/cb119368422
related: https://data.bnf.fr/ark:/12148/cb11939456c
related: cb11953309j
narrower: https://data.bnf.fr/ark:/12148/cb119322742
domaine litteral: Littérature générale
alternative label: Littérature et philosophie
editorial note: Littérature et philosophie / A. Tomiche, P. Zard, 2002. - . - Philosophie et littérature : approches et enjeux d'une question / P. Sabot, 2002. - . - Philosophie et poésie / M. Zambrano, 2003. - . -
related: https://data.bnf.fr/ark:/12148/cb119368422
narrower: https://data.bnf.fr/ark:/12148/cb119686689
FRBNF: 11970878
scope note: Sous cette vedette, on trouve les documents sur les relations entre la philosophie et la littérature. Les documents sur l'approche philosophique de la littérature se trouvent sous Littérature -- Philosophie
related: https://data.bnf.fr/ark:/12148/cb11961448f
related: https://data.bnf.fr/ark:/12148/cb11935351d
type: Concept

Literature--Philosophy