Culture populaire
related: https://data.bnf.fr/ark:/12148/cb11931420f
alternative label: Culture de rue
related: https://data.bnf.fr/ark:/12148/cb16222316f
alternative label: Culture des quartiers populaires
FRBNF: 13318541
domaine litteral: Sciences sociales. Sociologie
narrower: cb16193250v
is part of: r166
alternative label: Culture du peuple
scope note: Sous cette vedette, on trouve les documents sur la culture populaire par opposition à la culture d'élite. Les documents sur la culture populaire traditionnelle se trouvent sous Folklore. Les documents sur la culture diffusée par les médias à un large public se trouvent sous Culture de masse
broader: cb11931827z
alternative label: Culture pop
alternative label: Cultures populaires
alternative label: Culture des banlieues populaires
editorial note: Dict. des sciences humaines / S. Mesure, P. Savidan, 2006 (art. : Culture). - . - Lexique des sciences sociales / M. Gravitz, 1994 (art. : Culture et civilisation). - . - Sociologie de la culture populaire / A. Mouchtouris, 2007. - . -
alternative label: Culture des classes populaires
domaine: cb12648641g
created: 1985-07-06
modified: 2023-06-07
type: Concept
alternative label: Pop culture
alternative label: Culture ouvrière
related: https://data.bnf.fr/ark:/12148/cb133183362
related: cb17049927n
scope note: Voir aussi la subdivision Dans la culture populaire [+ subd géogr.] à tous sujets noms communs et noms propres, pour des études sur la représentation de ces sujets dans la culture populaire
P61160: http://www.rdaregistry.info/termList/statIdentification/1001
editorial note: Grand Robert de la langue française, 2001 (art. : Culture). - . - Eurovoc thesaurus. - http://europa.eu/eurovoc. - 2018-10-22

Popular culture