Élections
narrower: https://data.bnf.fr/ark:/12148/cb12465673f
narrower: https://data.bnf.fr/ark:/12148/cb133324291
narrower: cb11967228q
narrower: https://data.bnf.fr/ark:/12148/cb119501485
related: https://data.bnf.fr/ark:/12148/cb17097874f
related: https://data.bnf.fr/ark:/12148/cb135163060
domaine: cb13319064q
narrower: cb11948207k
alternative label: Élections législatives
narrower: cb12264768j
broader: cb13734407w
scope note: Ne pas employer pour les élections particulières ; voir la subdivision Élections (date), par ex. : France. Assemblée nationale (1958-....) -- Élections (1981)
narrower: cb11936998z
broader: cb13553871x
note: Sous cette vedette on trouve les documents sur le déroulement, les résultats, etc. de diverses consultations (élections au sens strict du terme, plébiscites, référendums). Les documents théoriques sur l'organisation des élections se trouvent sous la vedette Système électoral
P61160: http://www.rdaregistry.info/termList/statIdentification/1001
narrower: https://data.bnf.fr/ark:/12148/cb178527348
related: https://data.bnf.fr/ark:/12148/cb180255995
alternative label: Consulations électorales
FRBNF: 13318859
narrower: https://data.bnf.fr/ark:/12148/cb123528073
related: cb13545003h
narrower: https://data.bnf.fr/ark:/12148/cb11959533d
alternative label: Scrutins
created: 1985-07-06
modified: 2023-06-08
alternative label: Élections politiques
narrower: https://data.bnf.fr/ark:/12148/cb150261093
alternative label: Élections générales
narrower: https://data.bnf.fr/ark:/12148/cb165317537
type: Concept
narrower: https://data.bnf.fr/ark:/12148/cb157553751
related: cb16678677n
narrower: cb13319148r
narrower: cb12299842z
narrower: https://data.bnf.fr/ark:/12148/cb170147545
is part of: r166
narrower: cb13318741r
related: cb13757758r
scope note: S'emploie également en subdivision
narrower: https://data.bnf.fr/ark:/12148/cb119523722
narrower: cb14635490g
narrower: cb11941664t
narrower: cb15898574z
related: cb16630604p
related: cb12395254h
narrower: cb12302551q

Elections