Christianisme et philosophie
alternative label: Philosophie et christianisme
alternative label: Christianisme -- Philosophie
created: 1985-07-06
scope note: Sous cette vedette, on trouve les documents sur les relations entre la philosophie et le christianisme. Les documents sur la philosophie chrétienne se trouvent sous Philosophie chrétienne
related: cb16502422r
narrower: cb11979962h
domaine: cb11963568t
related match: Christianity -- Philosophy
is part of: r166
modified: 2017-11-30
broader: https://data.bnf.fr/ark:/12148/cb119329531
editorial note: Christianisme et philosophie / É. Gilson, 1981. - . - Philosophie et christianisme / J. Molard, 2007. - . - Le Christ philosophe / F. Lenoir, 2007. - . -
related: https://data.bnf.fr/ark:/12148/cb133186199
domaine: https://data.bnf.fr/ark:/12148/cb119368422
P61160: http://www.rdaregistry.info/termList/statIdentification/1001
type: Concept
narrower: cb12072043n
FRBNF: 13318879