Science politique
narrower: https://data.bnf.fr/ark:/12148/cb119712421
narrower: cb11955453s
scope note: Voir aussi la subdivision Politique et gouvernement aux groupes ethniques et lieux
narrower: cb12534189r
FRBNF: 13319064
related: cb13734259k
narrower: cb12231583j
narrower: cb13318377n
narrower: cb12012329p
narrower: cb11950239g
narrower: https://data.bnf.fr/ark:/12148/cb13318767f
narrower: cb12098825s
narrower: https://data.bnf.fr/ark:/12148/cb11972137d
related: cb15015696s
narrower: cb11960509k
related: https://data.bnf.fr/ark:/12148/cb119708951
narrower: cb11979427m
narrower: cb12127752w
narrower: cb11991973n
related: cb11937050q
narrower: cb11933461h
narrower: https://data.bnf.fr/ark:/12148/cb119423000
alternative label: Contribution à la science politique
related: cb11954994h
narrower: cb13553871x
alternative label: Politologie
narrower: https://data.bnf.fr/ark:/12148/cb119829385
type: Concept
narrower: https://data.bnf.fr/ark:/12148/cb133184141
narrower: https://data.bnf.fr/ark:/12148/cb170041320
narrower: cb16658980z
narrower: https://data.bnf.fr/ark:/12148/cb17780446d
modified: 2023-10-16
narrower: https://data.bnf.fr/ark:/12148/cb120990114
narrower: cb13319027h
narrower: cb11976886h
alternative label: Politique
P61160: http://www.rdaregistry.info/termList/statIdentification/1001
narrower: cb12653284n
narrower: cb16966774q
narrower: cb12383151h
narrower: cb16986869t
narrower: cb13340892m
narrower: cb13319578s
alternative label: Politique, Science
narrower: https://data.bnf.fr/ark:/12148/cb171549285
narrower: https://data.bnf.fr/ark:/12148/cb133184172
narrower: cb11947182t
narrower: https://data.bnf.fr/ark:/12148/cb126493698
related: cb16750047w
narrower: cb11930827q
alternative label: Statologie
narrower: cb11951019j
narrower: cb17155554v
created: 1985-07-06
narrower: cb13318320p
narrower: https://data.bnf.fr/ark:/12148/cb11978917f
narrower: cb12549422q
narrower: cb13757758r
related: cb12395149n
narrower: https://data.bnf.fr/ark:/12148/cb123949995
narrower: cb12311253j
related: cb11933106j
scope note: S'emploie également en subdivision
scope note: Voir aussi la subdivision Aspect politique
narrower: https://data.bnf.fr/ark:/12148/cb119342318
narrower: cb12047995z
narrower: https://data.bnf.fr/ark:/12148/cb170255573
narrower: cb13319076q
narrower: cb12010965q
narrower: cb12005884q
narrower: https://data.bnf.fr/ark:/12148/cb119342000
narrower: https://data.bnf.fr/ark:/12148/cb135350399
narrower: cb11932699h
narrower: https://data.bnf.fr/ark:/12148/cb137694876
narrower: cb13545003h
narrower: https://data.bnf.fr/ark:/12148/cb133189868
narrower: https://data.bnf.fr/ark:/12148/cb133191462
narrower: cb11934278x
narrower: cb11959669p

Political science