Postcolonialisme
narrower: https://data.bnf.fr/ark:/12148/cb177942283
domaine litteral: Sciences sociales. Sociologie
alternative label: Études subalternes
related: https://data.bnf.fr/ark:/12148/cb17780446d
created: 1999-11-24
related: https://data.bnf.fr/ark:/12148/cb18053290c
alternative label: Post-colonialisme
broader: cb13319064q
is part of: r166
FRBNF: 13535039
editorial note: Encycl. of contemporary literary theory / I. R. Makaryk, 1993. - . - Routledge encycl. of philosophy / E. Craig, 1998. - . - Postcolonialisme : inventaire et débats / B. Mongo Mboussa, 2000. - . -
type: Concept
related: https://data.bnf.fr/ark:/12148/cb155447891
related: cb18134522q
related: https://data.bnf.fr/ark:/12148/cb119583835
related: cb11974104x
domaine: cb13319064q
related: https://data.bnf.fr/ark:/12148/cb119671947
narrower: cb14597876k
narrower: https://data.bnf.fr/ark:/12148/cb170401305
P61160: http://www.rdaregistry.info/termList/statIdentification/1001
alternative label: Subaltern studies
scope note: Voir aussi la subdivision Influence coloniale aux lieux
alternative label: Études postcoloniales
note: Courant de pensée qui étudie le colonialisme et ses effets sur la culture des pays anciennement colonisés
modified: 2024-03-18

Postcolonialism